Reaction Details
TargetEphrin type-B receptor 3
LigandBDBM50311311
Substrate/Competitorn/a
Meas. Tech.ChEMBL_620507 (CHEMBL1107575)
IC50 460±n/a nM
Citation Qiao, LChoi, SCase, AGainer, TGSeyb, KGlicksman, MALo, DCStein, RLCuny, GD Structure-activity relationship study of EphB3 receptor tyrosine kinase inhibitors. Bioorg Med Chem Lett19:6122-6 (2009) 
 
Ephrin type-B receptor 3
Name:Ephrin type-B receptor 3
Type:Protein
Mol. Mass.:110326.17
Organism:Homo sapiens (Human)
Description:P54753
Residue:998
BDBM50311311
NameBDBM50311311
Synonyms:CHEMBL1078738 | N-(2-chlorophenyl)imidazo[1,2-a]pyridine-3-carboxamide
TypeSmall organic molecule
Emp. Form.C14H10ClN3O
Mol. Mass.271.702
SMILESClc1ccccc1NC(=O)c1cnc2ccccn12