Reaction Details
TargetEphrin type-B receptor 3
LigandBDBM50311313
Substrate/Competitorn/a
Meas. Tech.ChEMBL_620507 (CHEMBL1107575)
IC50 87±n/a nM
Citation Qiao, LChoi, SCase, AGainer, TGSeyb, KGlicksman, MALo, DCStein, RLCuny, GD Structure-activity relationship study of EphB3 receptor tyrosine kinase inhibitors. Bioorg Med Chem Lett19:6122-6 (2009) 
 
Ephrin type-B receptor 3
Name:Ephrin type-B receptor 3
Type:Protein
Mol. Mass.:110326.17
Organism:Homo sapiens (Human)
Description:P54753
Residue:998
BDBM50311313
NameBDBM50311313
Synonyms:CHEMBL1078840 | N-(2-chlorophenyl)-6-(piperidin-1-yl)imidazo[1,2-a]pyridine-3-carboxamide
TypeSmall organic molecule
Emp. Form.C19H19ClN4O
Mol. Mass.354.833
SMILESClc1ccccc1NC(=O)c1cnc2ccc(cn12)N1CCCCC1