Reaction Details
TargetEphrin type-B receptor 3
LigandBDBM50311317
Substrate/Competitorn/a
Meas. Tech.ChEMBL_620507 (CHEMBL1107575)
IC50 228±n/a nM
Citation Qiao, LChoi, SCase, AGainer, TGSeyb, KGlicksman, MALo, DCStein, RLCuny, GD Structure-activity relationship study of EphB3 receptor tyrosine kinase inhibitors. Bioorg Med Chem Lett19:6122-6 (2009) 
 
Ephrin type-B receptor 3
Name:Ephrin type-B receptor 3
Type:Protein
Mol. Mass.:110326.17
Organism:Homo sapiens (Human)
Description:P54753
Residue:998
BDBM50311317
NameBDBM50311317
Synonyms:CHEMBL1077740 | N-(2-chlorophenyl)-6-(4-hydroxypiperidin-4-yl)imidazo[1,2-a]pyridine-3-carboxamide
TypeSmall organic molecule
Emp. Form.C19H19ClN4O2
Mol. Mass.370.833
SMILESOC1(CCNCC1)c1ccc2ncc(C(=O)Nc3ccccc3Cl)n2c1