Reaction Details
TargetSomatostatin receptor type 2
LigandBDBM24226
Substrate/Competitorn/a
Meas. Tech.ChEMBL_621603 (CHEMBL1113035)
Ki>10000±n/a nM
Citation Martin, REMohr, PMaerki, HPGuba, WKuratli, CGavelle, OBinggeli, ABendels, SAlvarez-Sánchez, RAlker, APolonchuk, LChrist, AD Benzoxazole piperidines as selective and potent somatostatin receptor subtype 5 antagonists. Bioorg Med Chem Lett19:6106-13 (2009) 
 
Somatostatin receptor type 2
Name:Somatostatin receptor type 2
Type:Enzyme
Mol. Mass.:41344.94
Organism:Homo sapiens (Human)
Description:P30874
Residue:369
BDBM24226
NameBDBM24226
Synonyms:1-[(4-fluorophenyl)methyl]-N-{1-[2-(4-methoxyphenyl)ethyl]piperidin-4-yl}-1H-1,3-benzodiazol-2-amine Astemizole, [O-Methyl-3H] Hismanal [3H]-ASTEMIZOLE cid_2247 | med.21724, Compound Astemizole
TypeRadiolabeled ligand
Emp. Form.C28H31FN4O
Mol. Mass.458.5703
SMILESCOc1ccc(CCN2CCC(CC2)Nc2nc3ccccc3n2Cc2ccc(F)cc2)cc1