Reaction Details
TargetSomatostatin receptor type 5
LigandBDBM50227099
Substrate/Competitorn/a
Meas. Tech.ChEMBL_621599 (CHEMBL1113031)
Ki 13±n/a nM
Citation Martin, REMohr, PMaerki, HPGuba, WKuratli, CGavelle, OBinggeli, ABendels, SAlvarez-Sánchez, RAlker, APolonchuk, LChrist, AD Benzoxazole piperidines as selective and potent somatostatin receptor subtype 5 antagonists. Bioorg Med Chem Lett19:6106-13 (2009) 
 
Somatostatin receptor type 5
Name:Somatostatin receptor type 5
Type:Enzyme
Mol. Mass.:39218.02
Organism:Homo sapiens (Human)
Description:P35346
Residue:364
BDBM50227099
NameBDBM50227099
Synonyms:2-(1-(4-amino-3,5-diethoxybenzyl)piperidin-4-ylamino)benzo[d]oxazole-5-sulfonamide | CHEMBL236788
TypeSmall organic molecule
Emp. Form.C23H31N5O5S
Mol. Mass.489.588
SMILESCCOc1cc(CN2CCC(CC2)Nc2nc3cc(ccc3o2)S(N)(=O)=O)cc(OCC)c1N