Reaction Details
TargetcAMP-dependent protein kinase catalytic subunit alpha
LigandBDBM50311406
Substrate/Competitorn/a
Meas. Tech.ChEMBL_622263 (CHEMBL1110408)
IC50 390±n/a nM
Citation Enkvist, EKriisa, MRoben, MKadak, GRaidaru, GUri, A Effect of the structure of adenosine mimic of bisubstrate-analog inhibitors on their activity towards basophilic protein kinases. Bioorg Med Chem Lett19:6098-101 (2009) 
 
cAMP-dependent protein kinase catalytic subunit alpha
Name:cAMP-dependent protein kinase catalytic subunit alpha
Type:Enzyme Catalytic Subunit
Mol. Mass.:40598.73
Organism:Homo sapiens (Human)
Description:n/a
Residue:351
BDBM50311406
NameBDBM50311406
Synonyms:CHEMBL1077370 | N-((6R,9R,19R)-1-amino-19-(4-aminobutyl)-6-carbamoyl-9-(3-guanidinopropyl)-1-imino-8,11,18,21-tetraoxo-2,7,10,17,20-pentaazahexacosan-26-yl)-3-(pyridin-4-yl)benzamide
TypeSmall organic molecule
Emp. Form.C42H68N14O6
Mol. Mass.865.0795
SMILES[#7]-[#6]-[#6]-[#6]-[#6]-[#6@@H](-[#7]-[#6](=O)-[#6]-[#6]-[#6]-[#6]-[#6]-[#7]-[#6](=O)-c1cccc(c1)-c1ccncc1)-[#6](=O)-[#7]-[#6]-[#6]-[#6]-[#6]-[#6]-[#6](=O)-[#7]-[#6@H](-[#6]-[#6]-[#6]\[#7]=[#6](\[#7])-[#7])-[#6](=O)-[#7]-[#6@H](-[#6]-[#6]-[#6]\[#7]=[#6](\[#7])-[#7])-[#6](-[#7])=O