Reaction Details
TargetcAMP-dependent protein kinase catalytic subunit alpha
LigandBDBM50311409
Substrate/Competitorn/a
Meas. Tech.ChEMBL_622265 (CHEMBL1110410)
IC50 5.5±n/a nM
Citation Enkvist, EKriisa, MRoben, MKadak, GRaidaru, GUri, A Effect of the structure of adenosine mimic of bisubstrate-analog inhibitors on their activity towards basophilic protein kinases. Bioorg Med Chem Lett19:6098-101 (2009) 
 
cAMP-dependent protein kinase catalytic subunit alpha
Name:cAMP-dependent protein kinase catalytic subunit alpha
Type:Enzyme Catalytic Subunit
Mol. Mass.:40598.73
Organism:Homo sapiens (Human)
Description:n/a
Residue:351
BDBM50311409
NameBDBM50311409
Synonyms:CHEMBL1077375 | N-((6R,9R,12R,15R,18R,21R,31R)-1-amino-31-(4-aminobutyl)-6-carbamoyl-9,12,15,18,21-pentakis(3-guanidinopropyl)-1-imino-8,11,14,17,20,23,30,33-octaoxo-2,7,10,13,16,19,22,29,32-nonaazaoctatriacontan-38-yl)-5-(2-aminopyrimidin-4-yl)thiophene-2-carboxamide
TypeSmall organic molecule
Emp. Form.C63H114N32O10S
Mol. Mass.1511.853
SMILES[#7]-[#6]-[#6]-[#6]-[#6]-[#6@@H](-[#7]-[#6](=O)-[#6]-[#6]-[#6]-[#6]-[#6]-[#7]-[#6](=O)-c1ccc(s1)-c1ccnc(-[#7])n1)-[#6](=O)-[#7]-[#6]-[#6]-[#6]-[#6]-[#6]-[#6](=O)-[#7]-[#6@H](-[#6]-[#6]-[#6]\[#7]=[#6](\[#7])-[#7])-[#6](=O)-[#7]-[#6@H](-[#6]-[#6]-[#6]\[#7]=[#6](/[#7])-[#7])-[#6](=O)-[#7]-[#6@H](-[#6]-[#6]-[#6]\[#7]=[#6](\[#7])-[#7])-[#6](=O)-[#7]-[#6@H](-[#6]-[#6]-[#6]\[#7]=[#6](/[#7])-[#7])-[#6](=O)-[#7]-[#6@H](-[#6]-[#6]-[#6]\[#7]=[#6](/[#7])-[#7])-[#6](=O)-[#7]-[#6@H](-[#6]-[#6]-[#6]\[#7]=[#6](/[#7])-[#7])-[#6](-[#7])=O