Reaction Details
TargetCytochrome P450 2D6
LigandBDBM50311421
Substrate/Competitorn/a
Meas. Tech.ChEMBL_622573 (CHEMBL1109285)
IC50 1600±n/a nM
Citation Bailey, JMScott, JSBasilla, JBBolton, VJBoyfield, IEvans, DGFleury, EHeightman, TDJarvie, EMLawless, KMatthews, KLMcKay, FMok, HMuir, AOrlek, BSSanger, GJStemp, GStevens, AJThompson, MWard, JVaidya, KWestaway, SM The discovery and optimisation of benzazepine sulfonamide and sulfones as potent agonists of the motilin receptor. Bioorg Med Chem Lett19:6452-8 (2009) 
 
Cytochrome P450 2D6
Name:Cytochrome P450 2D6
Type:Protein
Mol. Mass.:55774.82
Organism:Homo sapiens (Human)
Description:P10635
Residue:497
BDBM50311421
NameBDBM50311421
Synonyms:7-((6-isopropoxypyridin-3-ylsulfonyl)methyl)-2,3,4,5-tetrahydro-1H-benzo[d]azepine | CHEMBL1078461
TypeSmall organic molecule
Emp. Form.C19H24N2O3S
Mol. Mass.360.47
SMILESCC(C)Oc1ccc(cn1)S(=O)(=O)Cc1ccc2CCNCCc2c1