Reaction Details
TargetEpidermal growth factor receptor
LigandBDBM50311463
Substrate/Competitorn/a
Meas. Tech.ChEMBL_622913 (CHEMBL1116652)
IC50 980±n/a nM
Citation Tang, PCFeng, JHuang, LXu, ZCheng, LZhang, XZhang, LHu, B Synthesis and biological evaluation of pyrrolopyridazine derivatives as novel HER-2 tyrosine kinase inhibitors. Bioorg Med Chem Lett19:6437-40 (2009) 
 
Epidermal growth factor receptor
Name:Epidermal growth factor receptor
Type:Receptor Kinase Domain
Mol. Mass.:134279.59
Organism:Homo sapiens (Human)
Description:P00533
Residue:1210
BDBM50311463
NameBDBM50311463
Synonyms:4-(3-chloro-4-(3-fluorobenzyloxy)phenylamino)-3-methyl-N-(3-(4-methylpiperazin-1-yl)propyl)-1H-pyrrolo[3,2-d]pyridazine-2-carboxamide | CHEMBL1081849
TypeSmall organic molecule
Emp. Form.C29H33ClFN7O2
Mol. Mass.566.069
SMILESCN1CCN(CCCNC(=O)c2[nH]c3cnnc(Nc4ccc(OCc5cccc(F)c5)c(Cl)c4)c3c2C)CC1