Reaction Details
TargetEpidermal growth factor receptor
LigandBDBM50311467
Substrate/Competitorn/a
Meas. Tech.ChEMBL_622913 (CHEMBL1116652)
IC50 1210±n/a nM
Citation Tang, PCFeng, JHuang, LXu, ZCheng, LZhang, XZhang, LHu, B Synthesis and biological evaluation of pyrrolopyridazine derivatives as novel HER-2 tyrosine kinase inhibitors. Bioorg Med Chem Lett19:6437-40 (2009) 
 
Epidermal growth factor receptor
Name:Epidermal growth factor receptor
Type:Receptor Kinase Domain
Mol. Mass.:134279.59
Organism:Homo sapiens (Human)
Description:P00533
Residue:1210
BDBM50311467
NameBDBM50311467
Synonyms:CHEMBL1080990 | ethyl 4-(3-chloro-4-(3-fluorobenzyloxy)phenylamino)-7-methyl-6H-pyrrolo[3,4-d]pyridazine-5-carboxylate
TypeSmall organic molecule
Emp. Form.C23H20ClFN4O3
Mol. Mass.454.881
SMILESCCOC(=O)c1[nH]c(C)c2cnnc(Nc3ccc(OCc4cccc(F)c4)c(Cl)c3)c12