Reaction Details
TargetEpidermal growth factor receptor
LigandBDBM5445
Substrate/Competitorn/a
Meas. Tech.ChEMBL_622913 (CHEMBL1116652)
IC50 140±n/a nM
Citation Tang, PCFeng, JHuang, LXu, ZCheng, LZhang, XZhang, LHu, B Synthesis and biological evaluation of pyrrolopyridazine derivatives as novel HER-2 tyrosine kinase inhibitors. Bioorg Med Chem Lett19:6437-40 (2009) 
 
Epidermal growth factor receptor
Name:Epidermal growth factor receptor
Type:Receptor Kinase Domain
Mol. Mass.:134279.59
Organism:Homo sapiens (Human)
Description:P00533
Residue:1210
BDBM5445
NameBDBM5445
Synonyms:CHEMBL554 LAPATINIB DITOSYLATE N-{3-chloro-4-[(3-fluoro-benzyl)oxy]phenyl}-6-[5-({2-(methylsulfonyl)ethyl]amino}methyl)-2-furyl]-4-quinazolinamine Tykerb US10822334, Compound Lapatinib cid_208908
TypeSmall organic molecule
Emp. Form.C29H26ClFN4O4S
Mol. Mass.581.058
SMILESCS(=O)(=O)CCNCc1ccc(o1)-c1ccc2ncnc(Nc3ccc(OCc4cccc(F)c4)c(Cl)c3)c2c1