Reaction Details
TargetMu-type opioid receptor
LigandBDBM50311481
Substrate/Competitorn/a
Meas. Tech.ChEMBL_622958 (CHEMBL1112210)
Ki 7.3±n/a nM
Citation Palin, RClark, JKEvans, LFeilden, HFletcher, DHamilton, NMHoughton, AKJones, PSMcArthur, DMontgomery, BRatcliffe, PDSmith, ARSutherland, AWeston, MAWishart, G Rapid access towards follow-up NOP receptor agonists using a knowledge based approach. Bioorg Med Chem Lett19:6441-6 (2009) 
 
Mu-type opioid receptor
Name:Mu-type opioid receptor
Type:G Protein-Coupled Receptor (GPCR)
Mol. Mass.:44789.51
Organism:Homo sapiens (Human)
Description:P35372
Residue:400
BDBM50311481
NameBDBM50311481
Synonyms:2-(8-(4-tert-butylcyclohexyl)-1-oxo-4-phenyl-2,3,8-triazaspiro[4.5]dec-3-en-2-yl)-N-methylacetamide | CHEMBL1079940
TypeSmall organic molecule
Emp. Form.C26H38N4O2
Mol. Mass.438.6055
SMILESCNC(=O)CN1N=C(c2ccccc2)C2(CCN(CC2)C2CCC(CC2)C(C)(C)C)C1=O