Reaction Details
TargetMu-type opioid receptor
LigandBDBM50311488
Substrate/Competitorn/a
Meas. Tech.ChEMBL_622958 (CHEMBL1112210)
Ki 27±n/a nM
Citation Palin, RClark, JKEvans, LFeilden, HFletcher, DHamilton, NMHoughton, AKJones, PSMcArthur, DMontgomery, BRatcliffe, PDSmith, ARSutherland, AWeston, MAWishart, G Rapid access towards follow-up NOP receptor agonists using a knowledge based approach. Bioorg Med Chem Lett19:6441-6 (2009) 
 
Mu-type opioid receptor
Name:Mu-type opioid receptor
Type:G Protein-Coupled Receptor (GPCR)
Mol. Mass.:44789.51
Organism:Homo sapiens (Human)
Description:P35372
Residue:400
BDBM50311488
NameBDBM50311488
Synonyms:2-(1'-cyclodecyl-2-oxospiro[benzo[d][1,3]oxazine-4,4'-piperidine]-1(2H)-yl)-N-methylacetamide | CHEMBL1080463
TypeSmall organic molecule
Emp. Form.C25H37N3O3
Mol. Mass.427.5796
SMILESCNC(=O)CN1C(=O)OC2(CCN(CC2)C2CCCCCCCCC2)c2ccccc12