Reaction Details
TargetNociceptin receptor
LigandBDBM50311490
Substrate/Competitorn/a
Meas. Tech.ChEMBL_622957 (CHEMBL1112209)
Ki 21±n/a nM
Citation Palin, RClark, JKEvans, LFeilden, HFletcher, DHamilton, NMHoughton, AKJones, PSMcArthur, DMontgomery, BRatcliffe, PDSmith, ARSutherland, AWeston, MAWishart, G Rapid access towards follow-up NOP receptor agonists using a knowledge based approach. Bioorg Med Chem Lett19:6441-6 (2009) 
 
Nociceptin receptor
Name:Nociceptin receptor
Type:G Protein-Coupled Receptor (GPCR)
Mol. Mass.:40702.87
Organism:Homo sapiens (Human)
Description:P41146
Residue:370
BDBM50311490
NameBDBM50311490
Synonyms:2-(1-(1-(4-isopropylcyclohexyl)piperidin-4-yl)-2-oxo-1,2-dihydroquinazolin-3(4H)-yl)-N-methylacetamide | CHEMBL1082092
TypeSmall organic molecule
Emp. Form.C25H38N4O2
Mol. Mass.426.5948
SMILESCNC(=O)CN1Cc2ccccc2N(C2CCN(CC2)C2CCC(CC2)C(C)C)C1=O