Reaction Details
TargetNociceptin receptor
LigandBDBM50311498
Substrate/Competitorn/a
Meas. Tech.ChEMBL_622957 (CHEMBL1112209)
Ki 29±n/a nM
Citation Palin, RClark, JKEvans, LFeilden, HFletcher, DHamilton, NMHoughton, AKJones, PSMcArthur, DMontgomery, BRatcliffe, PDSmith, ARSutherland, AWeston, MAWishart, G Rapid access towards follow-up NOP receptor agonists using a knowledge based approach. Bioorg Med Chem Lett19:6441-6 (2009) 
 
Nociceptin receptor
Name:Nociceptin receptor
Type:G Protein-Coupled Receptor (GPCR)
Mol. Mass.:40702.87
Organism:Homo sapiens (Human)
Description:P41146
Residue:370
BDBM50311498
NameBDBM50311498
Synonyms:CHEMBL1080507 | N-methyl-2-(3-(1-(naphthalen-1-ylmethyl)piperidin-4-yl)-2-oxo-2,3-dihydro-1H-benzo[d]imidazol-1-yl)acetamide
TypeSmall organic molecule
Emp. Form.C26H28N4O2
Mol. Mass.428.5261
SMILESCNC(=O)Cn1c2ccccc2n(C2CCN(Cc3cccc4ccccc34)CC2)c1=O