Reaction Details
TargetNociceptin receptor
LigandBDBM50311512
Substrate/Competitorn/a
Meas. Tech.ChEMBL_622957 (CHEMBL1112209)
Ki 0.200000±n/a nM
Citation Palin, RClark, JKEvans, LFeilden, HFletcher, DHamilton, NMHoughton, AKJones, PSMcArthur, DMontgomery, BRatcliffe, PDSmith, ARSutherland, AWeston, MAWishart, G Rapid access towards follow-up NOP receptor agonists using a knowledge based approach. Bioorg Med Chem Lett19:6441-6 (2009) 
 
Nociceptin receptor
Name:Nociceptin receptor
Type:G Protein-Coupled Receptor (GPCR)
Mol. Mass.:40702.87
Organism:Homo sapiens (Human)
Description:P41146
Residue:370
BDBM50311512
NameBDBM50311512
Synonyms:2-(3-(1-cyclodecylpiperidin-4-yl)-2-oxo-2,3-dihydro-1H-benzo[d]imidazol-1-yl)-N-methylacetamide | CHEMBL1088036
TypeSmall organic molecule
Emp. Form.C25H38N4O2
Mol. Mass.426.5948
SMILESCNC(=O)Cn1c2ccccc2n(C2CCN(CC2)C2CCCCCCCCC2)c1=O