Reaction Details
TargetDeoxycytidine kinase
LigandBDBM50311558
Substrate/Competitorn/a
Meas. Tech.ChEMBL_618319 (CHEMBL1101183)
IC50 6±n/a nM
Citation Tarver, JEJessop, TCCarlsen, MAugeri, DJFu, QHealy, JPHeim-Riether, AXu, ATaylor, JAShen, MKeyes, PEDavid Kimball, SYu, XCMiranda, MLiu, QSwaffield, JCNouraldeen, AWilson, AGFinch, RJhaver, KFoushee, AMAnderson, SOravecz, TCarson, KG 5-Fluorocytosine derivatives as inhibitors of deoxycytidine kinase. Bioorg Med Chem Lett19:6780-3 (2009) 
 
Deoxycytidine kinase
Name:Deoxycytidine kinase
Type:PROTEIN
Mol. Mass.:30510.65
Organism:Homo sapiens (Human)
Description:ChEMBL_1437135
Residue:260
BDBM50311558
NameBDBM50311558
Synonyms:5-fluoro-2-(1-(6-(2-fluorophenoxy)pyrimidin-4-yl)piperidin-4-yloxy)pyrimidin-4-amine | CHEMBL1081901
TypeSmall organic molecule
Emp. Form.C19H18F2N6O2
Mol. Mass.400.382
SMILESNc1nc(OC2CCN(CC2)c2cc(Oc3ccccc3F)ncn2)ncc1F