Reaction Details
TargetDeoxycytidine kinase
LigandBDBM50311603
Substrate/Competitorn/a
Meas. Tech.ChEMBL_618630 (CHEMBL1101518)
IC50 21±n/a nM
Citation Jessop, TCTarver, JECarlsen, MXu, AHealy, JPHeim-Riether, AFu, QTaylor, JAAugeri, DJShen, MStouch, TRSwanson, RVTari, LWHunter, MHoffman, IKeyes, PEYu, XCMiranda, MLiu, QSwaffield, JCDavid Kimball, SNouraldeen, AWilson, AGFoushee, AMJhaver, KFinch, RAnderson, SOravecz, TCarson, KG Lead optimization and structure-based design of potent and bioavailable deoxycytidine kinase inhibitors. Bioorg Med Chem Lett19:6784-7 (2009) 
 
Deoxycytidine kinase
Name:Deoxycytidine kinase
Type:PROTEIN
Mol. Mass.:30510.65
Organism:Homo sapiens (Human)
Description:ChEMBL_1437135
Residue:260
BDBM50311603
NameBDBM50311603
Synonyms:CHEMBL1079432 | N-((1S,3S)-3-(4-amino-5-fluoro-2-oxopyrimidin-1(2H)-yl)cyclopentyl)-4'-chloro-2'-methylbiphenyl-3-sulfonamide
TypeSmall organic molecule
Emp. Form.C22H22ClFN4O3S
Mol. Mass.476.951
SMILESCc1cc(Cl)ccc1-c1cccc(c1)S(=O)(=O)N[C@H]1CC[C@@H](C1)n1cc(F)c(N)nc1=O