Reaction Details
TargetTyrosine-protein kinase JAK3
LigandBDBM50311639
Substrate/Competitorn/a
Meas. Tech.ChEMBL_618677 (CHEMBL1102455)
IC50 14±n/a nM
Citation Cole, AGBohnstedt, ACParadkar, VKingsbury, CQuintero, JGPark, HLu, YYou, MNeagu, IDiller, DJLetourneau, JJShao, YJames, RARiviello, CMHo, KKLin, THWang, BAppell, KCSills, MQuadros, EKimble, EFOhlmeyer, MHWebb, ML 2-Benzimidazolyl-9-(chroman-4-yl)-purinone derivatives as JAK3 inhibitors. Bioorg Med Chem Lett19:6788-92 (2009) 
 
Tyrosine-protein kinase JAK3
Name:Tyrosine-protein kinase JAK3
Type:Protein
Mol. Mass.:125111.08
Organism:Homo sapiens (Human)
Description:P52333
Residue:1124
BDBM50311639
NameBDBM50311639
Synonyms:2-(6-chloro-1H-benzo[d]imidazol-1-yl)-9-(tetrahydro-2H-pyran-4-yl)-7H-purin-8(9H)-one | CHEMBL1080322
TypeSmall organic molecule
Emp. Form.C17H15ClN6O2
Mol. Mass.370.793
SMILESClc1ccc2ncn(-c3ncc4[nH]c(=O)n(C5CCOCC5)c4n3)c2c1