Reaction Details
TargetRho-associated protein kinase 2
LigandBDBM50311733
Substrate/Competitorn/a
Meas. Tech.ChEMBL_618707 (CHEMBL1102485)
IC50 500±n/a nM
Citation Yin, YLin, LRuiz, CCameron, MDPocas, JGrant, WSchröter, TChen, WDuckett, DSchürer, SLograsso, PFeng, Y Benzothiazoles as Rho-associated kinase (ROCK-II) inhibitors. Bioorg Med Chem Lett19:6686-90 (2009) 
 
Rho-associated protein kinase 2
Name:Rho-associated protein kinase 2
Type:Protein
Mol. Mass.:160885.43
Organism:Homo sapiens (Human)
Description:O75116
Residue:1388
BDBM50311733
NameBDBM50311733
Synonyms:2-(chroman-3-yl)-6-(1H-pyrazol-4-yl)-4-(2-(tetrahydrofuran-3-yl)ethoxy)benzo[d]thiazole | CHEMBL1080265
TypeSmall organic molecule
Emp. Form.C25H25N3O3S
Mol. Mass.447.549
SMILESC(CC1CCOC1)Oc1cc(cc2sc(nc12)C1COc2ccccc2C1)-c1cn[nH]c1