Reaction Details
TargetRho-associated protein kinase 2
LigandBDBM50311717
Substrate/Competitorn/a
Meas. Tech.ChEMBL_618709 (CHEMBL1102487)
IC50>2700±n/a nM
Citation Yin, YLin, LRuiz, CCameron, MDPocas, JGrant, WSchröter, TChen, WDuckett, DSchürer, SLograsso, PFeng, Y Benzothiazoles as Rho-associated kinase (ROCK-II) inhibitors. Bioorg Med Chem Lett19:6686-90 (2009) 
 
Rho-associated protein kinase 2
Name:Rho-associated protein kinase 2
Type:Protein
Mol. Mass.:160885.43
Organism:Homo sapiens (Human)
Description:O75116
Residue:1388
BDBM50311717
NameBDBM50311717
Synonyms:2-(chroman-3-yl)-4-fluoro-6-(1H-pyrazol-4-yl)benzo[d]thiazole | CHEMBL1081174
TypeSmall organic molecule
Emp. Form.C19H14FN3OS
Mol. Mass.351.397
SMILESFc1cc(cc2sc(nc12)C1COc2ccccc2C1)-c1cn[nH]c1