Reaction Details
TargetRho-associated protein kinase 1
LigandBDBM50311728
Substrate/Competitorn/a
Meas. Tech.ChEMBL_618949 (CHEMBL1099847)
IC50 2±n/a nM
Citation Yin, YLin, LRuiz, CCameron, MDPocas, JGrant, WSchröter, TChen, WDuckett, DSchürer, SLograsso, PFeng, Y Benzothiazoles as Rho-associated kinase (ROCK-II) inhibitors. Bioorg Med Chem Lett19:6686-90 (2009) 
 
Rho-associated protein kinase 1
Name:Rho-associated protein kinase 1
Type:Serine/threonine-protein kinase
Mol. Mass.:158156.77
Organism:Homo sapiens (Human)
Description:Q13464
Residue:1354
BDBM50311728
NameBDBM50311728
Synonyms:3-(6-(1H-pyrazol-4-yl)benzo[d]thiazol-2-yl)-N-(3-(dimethylamino)propyl)chroman-6-carboxamide SR-6074
TypeSmall organic molecule
Emp. Form.C25H27N5O2S
Mol. Mass.461.579
SMILESCN(C)CCCNC(=O)c1ccc2OCC(Cc2c1)c1nc2ccc(cc2s1)-c1cn[nH]c1