Reaction Details
TargetMitogen-activated protein kinase 10
LigandBDBM50311726
Substrate/Competitorn/a
Meas. Tech.ChEMBL_618951 (CHEMBL1099849)
IC50>20000±n/a nM
Citation Yin, YLin, LRuiz, CCameron, MDPocas, JGrant, WSchröter, TChen, WDuckett, DSchürer, SLograsso, PFeng, Y Benzothiazoles as Rho-associated kinase (ROCK-II) inhibitors. Bioorg Med Chem Lett19:6686-90 (2009) 
 
Mitogen-activated protein kinase 10
Name:Mitogen-activated protein kinase 10
Type:Enzyme
Mol. Mass.:52586.89
Organism:Homo sapiens (Human)
Description:n/a
Residue:464
BDBM50311726
NameBDBM50311726
Synonyms:CHEMBL1081196 | N-ethyl-N-(3-methoxybenzyl)-6-(1H-pyrazol-4-yl)benzo[d]thiazole-2-carboxamide
TypeSmall organic molecule
Emp. Form.C21H20N4O2S
Mol. Mass.392.474
SMILESCCN(Cc1cccc(OC)c1)C(=O)c1nc2ccc(cc2s1)-c1cn[nH]c1