Reaction Details
TargetMitogen-activated protein kinase 10
LigandBDBM50311713
Substrate/Competitorn/a
Meas. Tech.ChEMBL_618951 (CHEMBL1099849)
IC50 13760±n/a nM
Citation Yin, YLin, LRuiz, CCameron, MDPocas, JGrant, WSchröter, TChen, WDuckett, DSchürer, SLograsso, PFeng, Y Benzothiazoles as Rho-associated kinase (ROCK-II) inhibitors. Bioorg Med Chem Lett19:6686-90 (2009) 
 
Mitogen-activated protein kinase 10
Name:Mitogen-activated protein kinase 10
Type:Enzyme
Mol. Mass.:52586.89
Organism:Homo sapiens (Human)
Description:n/a
Residue:464
BDBM50311713
NameBDBM50311713
Synonyms:CHEMBL1080279 SR-6494
TypeSmall organic molecule
Emp. Form.C23H25N5O2S
Mol. Mass.435.542
SMILESCOc1cccc(CN(CCN(C)C)C(=O)c2nc3ccc(cc3s2)-c2cn[nH]c2)c1