Reaction Details
TargetHistamine H4 receptor
LigandBDBM22541
Substrate/Competitorn/a
Meas. Tech.ChEMBL_619282 (CHEMBL1100662)
Ki 4.3±n/a nM
Citation Łazewska, DWiecek, MLigneau, XKottke, TWeizel, LSeifert, RSchunack, WStark, HKiec-Kononowicz, K Histamine H3 and H4 receptor affinity of branched 3-(1H-imidazol-4-yl)propyl N-alkylcarbamates. Bioorg Med Chem Lett19:6682-5 (2009) 
 
Histamine H4 receptor
Name:Histamine H4 receptor
Type:G Protein-Coupled Receptor (GPCR)
Mol. Mass.:44517.02
Organism:Homo sapiens (Human)
Description:Binding assays were using CHO cells stably expressing hH4R receptors.
Residue:390
BDBM22541
NameBDBM22541
Synonyms:Clobenpropit VUF 9153 VUF9153
TypeSmall organic molecule
Emp. Form.C14H17ClN4S
Mol. Mass.308.83
SMILESNC(SCCCc1cnc[nH]1)=NCc1ccc(Cl)cc1