Reaction Details
TargetRenin
LigandBDBM50311800
Substrate/Competitorn/a
Meas. Tech.ChEMBL_619906 (CHEMBL1110296)
IC50 1.1±n/a nM
Citation Remen, LBezençon, ORichard-Bildstein, SBur, DPrade, LCorminboeuf, OBoss, CGrisostomi, CSifferlen, TStrickner, PHess, PDelahaye, STreiber, AWeller, TBinkert, CSteiner, BFischli, W New classes of potent and bioavailable human renin inhibitors. Bioorg Med Chem Lett19:6762-5 (2009) 
 
Renin
Name:Renin
Type:Enzyme
Mol. Mass.:45058.99
Organism:Homo sapiens (Human)
Description:n/a
Residue:406
BDBM50311800
NameBDBM50311800
Synonyms:(1R,5R)-3-(4-(3-(2-chloro-3,6-difluorophenoxy)propyl)phenyl)-N-cyclopropyl-N-(2,3-dichlorobenzyl)-9-azabicyclo[3.3.1]non-2-ene-2-carboxamide | CHEMBL1076444
TypeSmall organic molecule
Emp. Form.C34H33Cl3F2N2O2
Mol. Mass.645.994
SMILESFc1ccc(F)c(OCCCc2ccc(cc2)C2=C([C@H]3CCC[C@H](C2)N3)C(=O)N(Cc2cccc(Cl)c2Cl)C2CC2)c1Cl