Reaction Details
TargetTyrosine-protein kinase Lck
LigandBDBM50311909
Substrate/Competitorn/a
Meas. Tech.ChEMBL_619936 (CHEMBL1113978)
IC50 15±n/a nM
Citation Zhang, GRen, PGray, NSSim, TWang, XLiu, YChe, JDong, WTian, SSSandberg, MLSpalding, TARomeo, RIskandar, MWang, ZSeidel, HMKaranewsky, DSHe, Y Discovery of pyrimidine benzimidazoles as Src-family selective Lck inhibitors. Part II. Bioorg Med Chem Lett19:6691-5 (2009) 
 
Tyrosine-protein kinase Lck
Name:Tyrosine-protein kinase Lck
Type:n/a
Mol. Mass.:57987.83
Organism:Homo sapiens (Human)
Description:P06239
Residue:509
BDBM50311909
NameBDBM50311909
Synonyms:3-(1-(6-(4-(dimethylamino)butylamino)pyrimidin-4-yl)-1H-benzo[d]imidazol-2-ylamino)-4-methyl-N-(3-(trifluoromethyl)phenyl)benzamide | CHEMBL1076198
TypeSmall organic molecule
Emp. Form.C32H33F3N8O
Mol. Mass.602.6526
SMILESCN(C)CCCCNc1cc(ncn1)-n1c(Nc2cc(ccc2C)C(=O)Nc2cccc(c2)C(F)(F)F)nc2ccccc12