Reaction Details
TargetTyrosine-protein kinase HCK
LigandBDBM50311917
Substrate/Competitorn/a
Meas. Tech.ChEMBL_619934 (CHEMBL1113976)
IC50 43±n/a nM
Citation Zhang, GRen, PGray, NSSim, TWang, XLiu, YChe, JDong, WTian, SSSandberg, MLSpalding, TARomeo, RIskandar, MWang, ZSeidel, HMKaranewsky, DSHe, Y Discovery of pyrimidine benzimidazoles as Src-family selective Lck inhibitors. Part II. Bioorg Med Chem Lett19:6691-5 (2009) 
 
Tyrosine-protein kinase HCK
Name:Tyrosine-protein kinase HCK
Type:Enzyme Catalytic Domain
Mol. Mass.:59600.18
Organism:Homo sapiens (Human)
Description:P08631
Residue:526
BDBM50311917
NameBDBM50311917
Synonyms:CHEMBL1079945 | N-(3-(1-(6-aminopyrimidin-4-yl)-1H-benzo[d]imidazol-2-ylamino)-4-methylphenyl)-3-(trifluoromethyl)benzamide
TypeSmall organic molecule
Emp. Form.C26H20F3N7O
Mol. Mass.503.4785
SMILESCc1ccc(NC(=O)c2cccc(c2)C(F)(F)F)cc1Nc1nc2ccccc2n1-c1cc(N)ncn1