Reaction Details
TargetTyrosine-protein kinase Lck
LigandBDBM50311940
Substrate/Competitorn/a
Meas. Tech.ChEMBL_619936 (CHEMBL1113978)
IC50 7±n/a nM
Citation Zhang, GRen, PGray, NSSim, TWang, XLiu, YChe, JDong, WTian, SSSandberg, MLSpalding, TARomeo, RIskandar, MWang, ZSeidel, HMKaranewsky, DSHe, Y Discovery of pyrimidine benzimidazoles as Src-family selective Lck inhibitors. Part II. Bioorg Med Chem Lett19:6691-5 (2009) 
 
Tyrosine-protein kinase Lck
Name:Tyrosine-protein kinase Lck
Type:n/a
Mol. Mass.:57987.83
Organism:Homo sapiens (Human)
Description:P06239
Residue:509
BDBM50311940
NameBDBM50311940
Synonyms:CHEMBL1080475 | N-(3-(1-(6-aminopyrimidin-4-yl)-1H-benzo[d]imidazol-2-ylamino)-4-methylphenyl)-3-tert-butylisonicotinamide
TypeSmall organic molecule
Emp. Form.C28H28N8O
Mol. Mass.492.5749
SMILESCc1ccc(NC(=O)c2ccncc2C(C)(C)C)cc1Nc1nc2ccccc2n1-c1cc(N)ncn1