Reaction Details
TargetTyrosine-protein kinase Lyn
LigandBDBM50311920
Substrate/Competitorn/a
Meas. Tech.ChEMBL_619937 (CHEMBL1113979)
IC50 5±n/a nM
Citation Zhang, GRen, PGray, NSSim, TWang, XLiu, YChe, JDong, WTian, SSSandberg, MLSpalding, TARomeo, RIskandar, MWang, ZSeidel, HMKaranewsky, DSHe, Y Discovery of pyrimidine benzimidazoles as Src-family selective Lck inhibitors. Part II. Bioorg Med Chem Lett19:6691-5 (2009) 
 
Tyrosine-protein kinase Lyn
Name:Tyrosine-protein kinase Lyn
Type:Protein
Mol. Mass.:58575.92
Organism:Homo sapiens (Human)
Description:P07948
Residue:512
BDBM50311920
NameBDBM50311920
Synonyms:CHEMBL1076432 | N-(3-(1-(6-aminopyrimidin-4-yl)-1H-benzo[d]imidazol-2-ylamino)-4-methylphenyl)-3-(1-methylpiperidin-4-yloxy)-5-(trifluoromethyl)benzamide
TypeSmall organic molecule
Emp. Form.C32H31F3N8O2
Mol. Mass.616.6361
SMILESCN1CCC(CC1)Oc1cc(cc(c1)C(F)(F)F)C(=O)Nc1ccc(C)c(Nc2nc3ccccc3n2-c2cc(N)ncn2)c1