Reaction Details
TargetTyrosine-protein kinase Lyn
LigandBDBM50311926
Substrate/Competitorn/a
Meas. Tech.ChEMBL_619937 (CHEMBL1113979)
IC50 6±n/a nM
Citation Zhang, GRen, PGray, NSSim, TWang, XLiu, YChe, JDong, WTian, SSSandberg, MLSpalding, TARomeo, RIskandar, MWang, ZSeidel, HMKaranewsky, DSHe, Y Discovery of pyrimidine benzimidazoles as Src-family selective Lck inhibitors. Part II. Bioorg Med Chem Lett19:6691-5 (2009) 
 
Tyrosine-protein kinase Lyn
Name:Tyrosine-protein kinase Lyn
Type:Protein
Mol. Mass.:58575.92
Organism:Homo sapiens (Human)
Description:P07948
Residue:512
BDBM50311926
NameBDBM50311926
Synonyms:CHEMBL1076436 | N-(3-(1-(6-aminopyrimidin-4-yl)-1H-benzo[d]imidazol-2-ylamino)-4-methylphenyl)-3-(4-methylpiperazin-1-yl)-5-(trifluoromethyl)benzamide
TypeSmall organic molecule
Emp. Form.C31H30F3N9O
Mol. Mass.601.6248
SMILESCN1CCN(CC1)c1cc(cc(c1)C(F)(F)F)C(=O)Nc1ccc(C)c(Nc2nc3ccccc3n2-c2cc(N)ncn2)c1