Reaction Details
TargetTyrosine-protein kinase Lyn
LigandBDBM50311898
Substrate/Competitorn/a
Meas. Tech.ChEMBL_619937 (CHEMBL1113979)
IC50 16±n/a nM
Citation Zhang, GRen, PGray, NSSim, TWang, XLiu, YChe, JDong, WTian, SSSandberg, MLSpalding, TARomeo, RIskandar, MWang, ZSeidel, HMKaranewsky, DSHe, Y Discovery of pyrimidine benzimidazoles as Src-family selective Lck inhibitors. Part II. Bioorg Med Chem Lett19:6691-5 (2009) 
 
Tyrosine-protein kinase Lyn
Name:Tyrosine-protein kinase Lyn
Type:Protein
Mol. Mass.:58575.92
Organism:Homo sapiens (Human)
Description:P07948
Residue:512
BDBM50311898
NameBDBM50311898
Synonyms:3-(1-(6-aminopyrimidin-4-yl)-1H-benzo[d]imidazol-2-ylamino)-N-(3-tert-butylphenyl)-4-methylbenzamide | CHEMBL1087128
TypeSmall organic molecule
Emp. Form.C29H29N7O
Mol. Mass.491.5869
SMILESCc1ccc(cc1Nc1nc2ccccc2n1-c1cc(N)ncn1)C(=O)Nc1cccc(c1)C(C)(C)C