Reaction Details
TargetTyrosine-protein kinase Lyn
LigandBDBM50311908
Substrate/Competitorn/a
Meas. Tech.ChEMBL_619937 (CHEMBL1113979)
IC50 1228±n/a nM
Citation Zhang, GRen, PGray, NSSim, TWang, XLiu, YChe, JDong, WTian, SSSandberg, MLSpalding, TARomeo, RIskandar, MWang, ZSeidel, HMKaranewsky, DSHe, Y Discovery of pyrimidine benzimidazoles as Src-family selective Lck inhibitors. Part II. Bioorg Med Chem Lett19:6691-5 (2009) 
 
Tyrosine-protein kinase Lyn
Name:Tyrosine-protein kinase Lyn
Type:Protein
Mol. Mass.:58575.92
Organism:Homo sapiens (Human)
Description:P07948
Residue:512
BDBM50311908
NameBDBM50311908
Synonyms:4-methyl-3-(1-(6-(3-(4-methylpiperazin-1-yl)propylamino)pyrimidin-4-yl)-1H-benzo[d]imidazol-2-ylamino)-N-m-tolylbenzamide | CHEMBL1076197
TypeSmall organic molecule
Emp. Form.C34H39N9O
Mol. Mass.589.7332
SMILESCN1CCN(CCCNc2cc(ncn2)-n2c(Nc3cc(ccc3C)C(=O)Nc3cccc(C)c3)nc3ccccc23)CC1