Reaction Details
TargetVascular endothelial growth factor receptor 2
LigandBDBM50311921
Substrate/Competitorn/a
Meas. Tech.ChEMBL_619939 (CHEMBL1113981)
IC50 4±n/a nM
Citation Zhang, GRen, PGray, NSSim, TWang, XLiu, YChe, JDong, WTian, SSSandberg, MLSpalding, TARomeo, RIskandar, MWang, ZSeidel, HMKaranewsky, DSHe, Y Discovery of pyrimidine benzimidazoles as Src-family selective Lck inhibitors. Part II. Bioorg Med Chem Lett19:6691-5 (2009) 
 
Vascular endothelial growth factor receptor 2
Name:Vascular endothelial growth factor receptor 2
Type:Receptor Tyrosine Kinase
Mol. Mass.:151510.97
Organism:Homo sapiens (Human)
Description:P35968
Residue:1356
BDBM50311921
NameBDBM50311921
Synonyms:CHEMBL1086731 | N-(3-(1-(6-aminopyrimidin-4-yl)-1H-benzo[d]imidazol-2-ylamino)-4-methylphenyl)-5-tert-butylthiophene-2-carboxamide
TypeSmall organic molecule
Emp. Form.C27H27N7OS
Mol. Mass.497.615
SMILESCc1ccc(NC(=O)c2ccc(s2)C(C)(C)C)cc1Nc1nc2ccccc2n1-c1cc(N)ncn1