Reaction Details
TargetTyrosine-protein kinase HCK
LigandBDBM50311924
Substrate/Competitorn/a
Meas. Tech.ChEMBL_619934 (CHEMBL1113976)
IC50 9±n/a nM
Citation Zhang, GRen, PGray, NSSim, TWang, XLiu, YChe, JDong, WTian, SSSandberg, MLSpalding, TARomeo, RIskandar, MWang, ZSeidel, HMKaranewsky, DSHe, Y Discovery of pyrimidine benzimidazoles as Src-family selective Lck inhibitors. Part II. Bioorg Med Chem Lett19:6691-5 (2009) 
 
Tyrosine-protein kinase HCK
Name:Tyrosine-protein kinase HCK
Type:Enzyme Catalytic Domain
Mol. Mass.:59600.18
Organism:Homo sapiens (Human)
Description:P08631
Residue:526
BDBM50311924
NameBDBM50311924
Synonyms:CHEMBL1076433 | N-(3-(1-(6-aminopyrimidin-4-yl)-1H-benzo[d]imidazol-2-ylamino)-4-methylphenyl)-3-chloro-4-((4-ethylpiperazin-1-yl)methyl)benzamide
TypeSmall organic molecule
Emp. Form.C32H34ClN9O
Mol. Mass.596.125
SMILESCCN1CCN(Cc2ccc(cc2Cl)C(=O)Nc2ccc(C)c(Nc3nc4ccccc4n3-c3cc(N)ncn3)c2)CC1