Reaction Details
TargetAurora kinase B
LigandBDBM50311953
Substrate/Competitorn/a
Meas. Tech.ChEMBL_619949 (CHEMBL1113991)
IC50>50000±n/a nM
Citation Shim, JEid, CLee, JLiu, EChaudhary, DBoschelli, DH Synthesis and PKCtheta inhibitory activity of a series of 5-vinyl phenyl sulfonamide-3-pyridinecarbonitriles. Bioorg Med Chem Lett19:6575-7 (2009) 
 
Aurora kinase B
Name:Aurora kinase B
Type:Protein
Mol. Mass.:39327.72
Organism:Homo sapiens (Human)
Description:Q96GD4
Residue:344
BDBM50311953
NameBDBM50311953
Synonyms:4-(4-methyl-1H-indol-5-ylamino)-5-(3-(4-methylpiperazin-1-ylsulfonyl)styryl)nicotinonitrile | CHEMBL1080994
TypeSmall organic molecule
Emp. Form.C28H28N6O2S
Mol. Mass.512.626
SMILESCN1CCN(CC1)S(=O)(=O)c1cccc(\C=C\c2cncc(C#N)c2Nc2ccc3[nH]ccc3c2C)c1