Reaction Details
TargetSerine/threonine-protein kinase Chk1
LigandBDBM50311954
Substrate/Competitorn/a
Meas. Tech.ChEMBL_619966 (CHEMBL1114008)
IC50>50000±n/a nM
Citation Shim, JEid, CLee, JLiu, EChaudhary, DBoschelli, DH Synthesis and PKCtheta inhibitory activity of a series of 5-vinyl phenyl sulfonamide-3-pyridinecarbonitriles. Bioorg Med Chem Lett19:6575-7 (2009) 
 
Serine/threonine-protein kinase Chk1
Name:Serine/threonine-protein kinase Chk1
Type:Enzyme Catalytic Domain
Mol. Mass.:54443.02
Organism:Homo sapiens (Human)
Description:gi_166295192
Residue:476
BDBM50311954
NameBDBM50311954
Synonyms:6-methyl-4-(4-methyl-1H-indol-5-ylamino)-5-(3-(4-methylpiperazin-1-ylsulfonyl)styryl)nicotinonitrile | CHEMBL1080995
TypeSmall organic molecule
Emp. Form.C29H30N6O2S
Mol. Mass.526.653
SMILESCN1CCN(CC1)S(=O)(=O)c1cccc(\C=C\c2c(C)ncc(C#N)c2Nc2ccc3[nH]ccc3c2C)c1