Reaction Details
TargetProtein kinase C theta type
LigandBDBM50311954
Substrate/Competitorn/a
Meas. Tech.ChEMBL_619965 (CHEMBL1114007)
IC50 0.440000±n/a nM
Citation Shim, JEid, CLee, JLiu, EChaudhary, DBoschelli, DH Synthesis and PKCtheta inhibitory activity of a series of 5-vinyl phenyl sulfonamide-3-pyridinecarbonitriles. Bioorg Med Chem Lett19:6575-7 (2009) 
 
Protein kinase C theta type
Name:Protein kinase C theta type
Type:Serine/threonine-protein kinase
Mol. Mass.:81878.04
Organism:Homo sapiens (Human)
Description:Full-length human PKC theta (Panvera Catalog No. P2996).
Residue:706
BDBM50311954
NameBDBM50311954
Synonyms:6-methyl-4-(4-methyl-1H-indol-5-ylamino)-5-(3-(4-methylpiperazin-1-ylsulfonyl)styryl)nicotinonitrile | CHEMBL1080995
TypeSmall organic molecule
Emp. Form.C29H30N6O2S
Mol. Mass.526.653
SMILESCN1CCN(CC1)S(=O)(=O)c1cccc(\C=C\c2c(C)ncc(C#N)c2Nc2ccc3[nH]ccc3c2C)c1