Reaction Details
TargetProtein kinase C theta type
LigandBDBM50311955
Substrate/Competitorn/a
Meas. Tech.ChEMBL_619965 (CHEMBL1114007)
IC50 2.4±n/a nM
Citation Shim, JEid, CLee, JLiu, EChaudhary, DBoschelli, DH Synthesis and PKCtheta inhibitory activity of a series of 5-vinyl phenyl sulfonamide-3-pyridinecarbonitriles. Bioorg Med Chem Lett19:6575-7 (2009) 
 
Protein kinase C theta type
Name:Protein kinase C theta type
Type:Serine/threonine-protein kinase
Mol. Mass.:81878.04
Organism:Homo sapiens (Human)
Description:Full-length human PKC theta (Panvera Catalog No. P2996).
Residue:706
BDBM50311955
NameBDBM50311955
Synonyms:6-methyl-4-(4-methyl-1H-indol-5-ylamino)-5-(3-(pyrrolidin-1-ylsulfonyl)styryl)nicotinonitrile | CHEMBL1080103
TypeSmall organic molecule
Emp. Form.C28H27N5O2S
Mol. Mass.497.611
SMILESCc1ncc(C#N)c(Nc2ccc3[nH]ccc3c2C)c1\C=C\c1cccc(c1)S(=O)(=O)N1CCCC1