Reaction Details
TargetProtein kinase C delta type
LigandBDBM50311945
Substrate/Competitorn/a
Meas. Tech.ChEMBL_619964 (CHEMBL1114006)
IC50 114±n/a nM
Citation Shim, JEid, CLee, JLiu, EChaudhary, DBoschelli, DH Synthesis and PKCtheta inhibitory activity of a series of 5-vinyl phenyl sulfonamide-3-pyridinecarbonitriles. Bioorg Med Chem Lett19:6575-7 (2009) 
 
Protein kinase C delta type
Name:Protein kinase C delta type
Type:Enzyme
Mol. Mass.:77516.79
Organism:Homo sapiens (Human)
Description:The recombinant human PKC enzymes were produced using a baculovirus expression system in SF9 cells
Residue:676
BDBM50311945
NameBDBM50311945
Synonyms:4-(2-(5-cyano-4-(4-methyl-1H-indol-5-ylamino)pyridin-3-yl)vinyl)benzenesulfonamide | CHEMBL1080801
TypeSmall organic molecule
Emp. Form.C23H19N5O2S
Mol. Mass.429.494
SMILESCc1c(Nc2c(\C=C\c3ccc(cc3)S(N)(=O)=O)cncc2C#N)ccc2[nH]ccc12