Reaction Details
TargetProtein kinase C theta type
LigandBDBM50311964
Substrate/Competitorn/a
Meas. Tech.ChEMBL_619965 (CHEMBL1114007)
IC50 23±n/a nM
Citation Shim, JEid, CLee, JLiu, EChaudhary, DBoschelli, DH Synthesis and PKCtheta inhibitory activity of a series of 5-vinyl phenyl sulfonamide-3-pyridinecarbonitriles. Bioorg Med Chem Lett19:6575-7 (2009) 
 
Protein kinase C theta type
Name:Protein kinase C theta type
Type:Serine/threonine-protein kinase
Mol. Mass.:81878.04
Organism:Homo sapiens (Human)
Description:Full-length human PKC theta (Panvera Catalog No. P2996).
Residue:706
BDBM50311964
NameBDBM50311964
Synonyms:4-(4-methyl-1H-indol-5-ylamino)-5-(4-(4-methylpiperazin-1-ylsulfonyl)styryl)nicotinonitrile | CHEMBL1079435
TypeSmall organic molecule
Emp. Form.C28H28N6O2S
Mol. Mass.512.626
SMILESCN1CCN(CC1)S(=O)(=O)c1ccc(\C=C\c2cncc(C#N)c2Nc2ccc3[nH]ccc3c2C)cc1