Reaction Details
TargetProtein kinase C theta type
LigandBDBM50311965
Substrate/Competitorn/a
Meas. Tech.ChEMBL_619965 (CHEMBL1114007)
IC50 6±n/a nM
Citation Shim, JEid, CLee, JLiu, EChaudhary, DBoschelli, DH Synthesis and PKCtheta inhibitory activity of a series of 5-vinyl phenyl sulfonamide-3-pyridinecarbonitriles. Bioorg Med Chem Lett19:6575-7 (2009) 
 
Protein kinase C theta type
Name:Protein kinase C theta type
Type:Serine/threonine-protein kinase
Mol. Mass.:81878.04
Organism:Homo sapiens (Human)
Description:Full-length human PKC theta (Panvera Catalog No. P2996).
Residue:706
BDBM50311965
NameBDBM50311965
Synonyms:4-(4-methyl-1H-indol-5-ylamino)-5-(4-(pyrrolidin-1-ylsulfonyl)styryl)nicotinonitrile | CHEMBL1079611
TypeSmall organic molecule
Emp. Form.C27H25N5O2S
Mol. Mass.483.585
SMILESCc1c(Nc2c(\C=C\c3ccc(cc3)S(=O)(=O)N3CCCC3)cncc2C#N)ccc2[nH]ccc12