Reaction Details
TargetSerine/threonine-protein kinase B-raf
LigandBDBM50026030
Substrate/Competitorn/a
Meas. Tech.ChEMBL_620206 (CHEMBL1115841)
IC50<0.320000±n/a nM
Citation Wang, XBerger, DMSalaski, EJTorres, NHu, YLevin, JIPowell, DWojciechowicz, DCollins, KFrommer, E Discovery of highly potent and selective type I B-Raf kinase inhibitors. Bioorg Med Chem Lett19:6571-4 (2009) 
 
Serine/threonine-protein kinase B-raf
Name:Serine/threonine-protein kinase B-raf
Type:Serine/threonine-protein kinase
Mol. Mass.:84446.00
Organism:Homo sapiens (Human)
Description:P15056
Residue:766
BDBM50026030
NameBDBM50026030
Synonyms:CHEMBL1080833
TypeSmall organic molecule
Emp. Form.C30H27ClN6O
Mol. Mass.523.028
SMILESCN1C2CCC1CN(C2)c1ccc(cc1)-c1ccnc2c(c(nn12)-c1ccncc1)-c1ccc(Cl)c(O)c1