Reaction Details
TargetAurora kinase B
LigandBDBM50311985
Substrate/Competitorn/a
Meas. Tech.ChEMBL_620211 (CHEMBL1115846)
IC50 25500±n/a nM
Citation Wang, XBerger, DMSalaski, EJTorres, NHu, YLevin, JIPowell, DWojciechowicz, DCollins, KFrommer, E Discovery of highly potent and selective type I B-Raf kinase inhibitors. Bioorg Med Chem Lett19:6571-4 (2009) 
 
Aurora kinase B
Name:Aurora kinase B
Type:Protein
Mol. Mass.:39327.72
Organism:Homo sapiens (Human)
Description:Q96GD4
Residue:344
BDBM50311985
NameBDBM50311985
Synonyms:3-(7-(4-((1S,4S)-5-methyl-2,5-diazabicyclo[2.2.1]heptan-2-yl)phenyl)-2-(pyridin-4-yl)pyrazolo[1,5-a]pyrimidin-3-yl)phenol | CHEMBL1087650
TypeSmall organic molecule
Emp. Form.C29H26N6O
Mol. Mass.474.5563
SMILESCN1C[C@@H]2C[C@H]1CN2c1ccc(cc1)-c1ccnc2c(c(nn12)-c1ccncc1)-c1cccc(O)c1