Reaction Details
TargetSerine/threonine-protein kinase B-raf
LigandBDBM50311983
Substrate/Competitorn/a
Meas. Tech.ChEMBL_620206 (CHEMBL1115841)
IC50 1±n/a nM
Citation Wang, XBerger, DMSalaski, EJTorres, NHu, YLevin, JIPowell, DWojciechowicz, DCollins, KFrommer, E Discovery of highly potent and selective type I B-Raf kinase inhibitors. Bioorg Med Chem Lett19:6571-4 (2009) 
 
Serine/threonine-protein kinase B-raf
Name:Serine/threonine-protein kinase B-raf
Type:Serine/threonine-protein kinase
Mol. Mass.:84446.00
Organism:Homo sapiens (Human)
Description:P15056
Residue:766
BDBM50311983
NameBDBM50311983
Synonyms:(R)-3-(2-(pyridin-4-yl)-7-(4-(quinuclidin-3-ylamino)phenyl)pyrazolo[1,5-a]pyrimidin-3-yl)phenol | CHEMBL1086871
TypeSmall organic molecule
Emp. Form.C30H28N6O
Mol. Mass.488.5829
SMILESOc1cccc(c1)-c1c(nn2c(ccnc12)-c1ccc(N[C@H]2CN3CCC2CC3)cc1)-c1ccncc1