Reaction Details
TargetSerine/threonine-protein kinase B-raf
LigandBDBM50294451
Substrate/Competitorn/a
Meas. Tech.ChEMBL_620206 (CHEMBL1115841)
IC50 1500±n/a nM
Citation Wang, XBerger, DMSalaski, EJTorres, NHu, YLevin, JIPowell, DWojciechowicz, DCollins, KFrommer, E Discovery of highly potent and selective type I B-Raf kinase inhibitors. Bioorg Med Chem Lett19:6571-4 (2009) 
 
Serine/threonine-protein kinase B-raf
Name:Serine/threonine-protein kinase B-raf
Type:Serine/threonine-protein kinase
Mol. Mass.:84446.00
Organism:Homo sapiens (Human)
Description:P15056
Residue:766
BDBM50294451
NameBDBM50294451
Synonyms:CHEMBL565061 pyrazolo[1,5-a]pyrimidine-3-carboxylate
TypeSmall organic molecule
Emp. Form.C23H17F3N4O3
Mol. Mass.454.4013
SMILESCCOC(=O)c1cnn2c(ccnc12)-c1cccc(NC(=O)c2cccc(c2)C(F)(F)F)c1