Reaction Details
TargetNeuropeptide Y receptor type 1
LigandBDBM50312032
Substrate/Competitorn/a
Meas. Tech.ChEMBL_620603 (CHEMBL1112064)
Ki 50±n/a nM
Citation Sun, ZYZhu, ZYe, YMcKittrick, BCzarniecki, MGreenlee, WMullins, DGuzzi, M Discovery and SAR of cyclic isothioureas as novel NPY Y1 receptor antagonists. Bioorg Med Chem Lett19:6801-5 (2009) 
 
Neuropeptide Y receptor type 1
Name:Neuropeptide Y receptor type 1
Type:Enzyme Catalytic Domain
Mol. Mass.:44399.07
Organism:Homo sapiens (Human)
Description:NPY-Y1 NPY1R HUMAN::P25929
Residue:384
BDBM50312032
NameBDBM50312032
Synonyms:(+/-)-N-(4-(4-methyl-5,6-dihydro-4H-1,3-thiazin-2-ylamino)phenethyl)benzo[d]thiazol-2-amine | CHEMBL1080291
TypeSmall organic molecule
Emp. Form.C20H22N4S2
Mol. Mass.382.545
SMILESCC1CCSC(N1)=Nc1ccc(CCNc2nc3ccccc3s2)cc1