Reaction Details
TargetMetabotropic glutamate receptor 5
LigandBDBM50312125
Substrate/Competitorn/a
Meas. Tech.ChEMBL_620938 (CHEMBL1117583)
IC50>30000±n/a nM
Citation Zhou, YRodriguez, ALWilliams, RWeaver, CDConn, PJLindsley, CW Synthesis and SAR of novel, non-MPEP chemotype mGluR5 NAMs identified by functional HTS. Bioorg Med Chem Lett19:6502-6 (2009) 
 
Metabotropic glutamate receptor 5
Name:Metabotropic glutamate receptor 5
Type:Enzyme
Mol. Mass.:131900.14
Organism:Rattus norvegicus (Rat)
Description:P31424
Residue:1203
BDBM50312125
NameBDBM50312125
Synonyms:3-chloro-N-(3-(3-methylbenzamido)phenyl)benzamide | CHEMBL1086899
TypeSmall organic molecule
Emp. Form.C21H17ClN2O2
Mol. Mass.364.825
SMILESCc1cccc(c1)C(=O)Nc1cccc(NC(=O)c2cccc(Cl)c2)c1