Reaction Details
TargetRAC-alpha serine/threonine-protein kinase
LigandBDBM50312153
Substrate/Competitorn/a
Meas. Tech.ChEMBL_621328 (CHEMBL1109421)
IC50 50000±n/a nM
Citation Mitchell, SADanca, MDBlomgren, PADarrow, JWCurrie, KSKropf, JELee, SHGallion, SLXiong, JMPippin, DADeSimone, RWBrittelli, DREustice, DCBourret, AHill-Drzewi, MMaciejewski, PMElkin, LL Imidazo[1,2-a]pyrazine diaryl ureas: inhibitors of the receptor tyrosine kinase EphB4. Bioorg Med Chem Lett19:6991-5 (2009) 
 
RAC-alpha serine/threonine-protein kinase
Name:RAC-alpha serine/threonine-protein kinase
Type:Enzyme
Mol. Mass.:55681.25
Organism:Homo sapiens (Human)
Description:P31749
Residue:480
BDBM50312153
NameBDBM50312153
Synonyms:1-(3-(8-(pyridin-4-ylmethylamino)imidazo[1,2-a]pyrazin-6-yl)phenyl)-3-(3-(trifluoromethyl)phenyl)urea | CHEMBL1081198
TypeSmall organic molecule
Emp. Form.C26H20F3N7O
Mol. Mass.503.4785
SMILESFC(F)(F)c1cccc(NC(=O)Nc2cccc(c2)-c2cn3ccnc3c(NCc3ccncc3)n2)c1