Reaction Details
TargetEphrin type-B receptor 4
LigandBDBM50312161
Substrate/Competitorn/a
Meas. Tech.ChEMBL_621633 (CHEMBL1115704)
IC50 6800±n/a nM
Citation Mitchell, SADanca, MDBlomgren, PADarrow, JWCurrie, KSKropf, JELee, SHGallion, SLXiong, JMPippin, DADeSimone, RWBrittelli, DREustice, DCBourret, AHill-Drzewi, MMaciejewski, PMElkin, LL Imidazo[1,2-a]pyrazine diaryl ureas: inhibitors of the receptor tyrosine kinase EphB4. Bioorg Med Chem Lett19:6991-5 (2009) 
 
Ephrin type-B receptor 4
Name:Ephrin type-B receptor 4
Type:Enzyme
Mol. Mass.:108273.51
Organism:Homo sapiens (Human)
Description:P54760
Residue:987
BDBM50312161
NameBDBM50312161
Synonyms:1-(3-(8-(pyridin-4-ylmethylamino)imidazo[1,2-a]pyrazin-6-yl)benzyl)-3-(3-(trifluoromethyl)phenyl)urea | CHEMBL1081228
TypeSmall organic molecule
Emp. Form.C27H22F3N7O
Mol. Mass.517.5051
SMILESFC(F)(F)c1cccc(NC(=O)NCc2cccc(c2)-c2cn3ccnc3c(NCc3ccncc3)n2)c1